ninja install

......

CMake Error at cmake_install.cmake:36 (FILE):
  file INSTALL cannot find
  "/home/dmerejkowsky/src/master/ninjabug/build/CMakeFiles/CMakeRelink.dir/libbar.so".

.......

add set(CMAKE_EXECUTABLE_FORMAT "ELF") to CMakeList.txt beginning.

ref: http://public.kitware.com/Bug/view.php?id=13934#c34731

ninja install error的更多相关文章

  1. pip install Error - ReadTimeoutError: HTTPSConnectionPool

    pip install Error OSX 终端更新pip出错 sudo pip install --upgrade pip : 1.ReadTimeoutError: HTTPSConnection ...

  2. Pod install Error List

    1. Error installing Crashlytics while executing pod install [!] Error installing Crashlytics [!] /us ...

  3. The APK failed to install. Error:Could not parse error string.

    问题一: The APK failed to install. Error:Could not parse error string. 今天拖拽自己的apk到模拟器上运行,报上述错误. 搜索解决方案. ...

  4. redhat 6安装python 3.7.4报错ModuleNotFoundError: No module named '_ctypes' make: *** [install] Error 1

    问题描述: 今天在测试环境中,为了执行脚本,安装下python3命令,在执行make install的时候报错: ModuleNotFoundError: No module named '_ctyp ...

  5. [pod install] error: cannot open .git/FETCH_HEAD: Permission denied

    pod installAnalyzing dependencies[!] Pod::Executable pull error: cannot open .git/FETCH_HEAD: Permis ...

  6. npm install Error:EPROTO: protocol error, symlink '../mime/cli.js' -> '/vagrant/src/nodejs/node_modules/express/node_modules/send/node_modules/.bin/mime'

    我在ubuntu上使用npm安装依赖是出现下面错误: npm ERR! Linux 3.13.0-101-genericnpm ERR! argv "/usr/bin/nodejs" ...

  7. SSL backend error when using OpenSSL pycurl install error

    centos7 pip install pycurl 错误 pip uninstall pycurl export PYCURL_SSL_LIBRARY=nss pip install pycurl ...

  8. 模拟器 Unable to execute simctl install Error 117

    ios 模拟器 Unable to execute '"/usr/bin/xcrun" simctl install  "/Users/tt/PAServer/scrat ...

  9. MVN package install error javac: invalid target release: 1.8

    现象:---------------------------------[ERROR] Failure executing javac, but could not parse the error:j ...

随机推荐

  1. mysql导入数据方法和报错解决

    mysql -u root -p databasename < db.sql 数据库导入数据时,MySQL收到下面异常:ERROR 1153 (08S01): Got a packet bigg ...

  2. Verilog篇(四)时序模型

    时序模型:仿真器的时间推进模型,它反映了推进仿真时间和调度事件的方式. 1)门级时序模型:适用于分析所有的连续赋值语句,过程连续赋值语句,门级原语,用户自定义原语. 特点:任意时刻,任意输入变化都将重 ...

  3. SQL语句常见优化方法

    Sql优化方法 先进行选择运算(where limit)再进行连接运算 where子句中应把过滤性最强的条件放在最前面 where子句中字段的顺序应和组合索引中字段顺序一致 使用索引 使用覆盖索引来避 ...

  4. jquery easyUI相关

    jquery easyUI相关===================================easyUI表单验证处理//jquery easyUI 表单验证不通过让光标定位在第一个未通过验证的 ...

  5. git必备命令

    git status 查看git的状态git add <path>的形式把我们<path>添加到索引库中,<path>可以是文件也可以是目录.git add -u ...

  6. python之路----面向对象中的内置函数

    property属性 什么是特性property property是一种特殊的属性,访问它时会执行一段功能(函数)然后返回值 例一:BMI指数(bmi是计算而来的,但很明显它听起来像是一个属性而非方法 ...

  7. 高可用Mysql架构_Mysql主从复制、Mysql双主热备、Mysql双主双从、Mysql读写分离(Mycat中间件)、Mysql分库分表架构(Mycat中间件)的演变

    [Mysql主从复制]解决的问题数据分布:比如一共150台机器,分别往电信.网通.移动各放50台,这样无论在哪个网络访问都很快.其次按照地域,比如国内国外,北方南方,这样地域性访问解决了.负载均衡:M ...

  8. 《网络攻防》实验五:MSF基础应用

    IE浏览器渗透攻击--MS11050安全漏洞 实验准备 1.两台虚拟机,其中一台为kali,一台为Windows Xp Professional(两台虚拟机可以相互间ping通). 2.亚军同学的指导 ...

  9. Android 实践项目开发一

    这次做的项目是—手机地图系统 本次实验的功能是,为用户提供需要的目标定位系统定位处理,即用户设置一个目标后, 可以在后台启动一个Service,能够定时读取GPS数据已获得用户当前所在的位置信息, 并 ...

  10. STM32.SPI(25Q16)

    1.首先认识下W25Q16DVSIG, SOP8 SPI FLASH 16MBIT  2MB(4096个字节) (里面可以放字库,图片,也可以程序掉电不丢失数据放里面) 例程讲解: ① 1.用到SPI ...