linker command failed with exit code 1
这种问题,通常出现在添加第三方库文件或者多人开发时。
这种问题一般是找不到文件而导致的链接错误。 我们可以从如下几个方面着手排查。
1.以如下错误为例,如果是多人开发,你同步完成后发现出现如下的错误。
- Undefined symbols for architecture armv7:
- "_OBJC_CLASS_$_MyPageLogViewController", referenced from:
- objc-class-ref in BaiduMobStatAppDelegate.o
- ld: symbol(s) not found for architecture armv7
- clang: error: linker command failed with exit code 1 (use -v to see invocation)
错误中出现了“MyPageLogViewController”这个类,你可以找到这个类的.m文件, 查看他的Target Membeship, 如下图
如果没有勾选上,点击勾选。然后编译查看。
2. 如果是新添加的第三方库,且不是静态库
先重复第一步过程,然后找到 Build settings->Linking->Other Linker Flags
将此属性修改成-all_load 或者 -ObjC ,这个视情况而定。总之可以多试几次。
3.如果添加的是第三方静态库(.a文件)
- Undefined symbols for architecture armv7:
- "_OBJC_CLASS_$_BaiduMobStat", referenced from:
- objc-class-ref in BaiduMobStatAppDelegate.o
- objc-class-ref in MyPageLogViewController.o
- (maybe you meant: _OBJC_CLASS_$_BaiduMobStatAppDelegate)
- ld: symbol(s) not found for architecture armv7
- clang: error: linker command failed with exit code 1 (use -v to see invocation)
在用到这个库的所有文件中都出现了错误, 如上 BaiduMobStatAppDelegate 类和 MyPageLogViewController类
这种情况就可能是这个静态库路径混乱导致的链接错误
解决方法:Build settings->Search Path->Library Search Paths 添加静态库的相应路径。如下图
如果上面的所有方法都不管用。你可以再试试一下几个方法:
1,看看是不是有新添加的文件跟之前文件同名
2,错误信息中出现了某个类的名字,去原文件中看看#import了哪些第三方库,把这些库挨个注释排除,找到出错的那个库,然后按照官方提供的步骤重新添加一遍。
linker command failed with exit code 1 (use -v to see invocation)的错误调试
情况1、
linker command failed with exit code 1 (use -v to see invocation)这个错误貌似遇见并不止一次,当我想用某个第三方类库的时候(如SBJson),我直接把类库文件copy到工程目录里面,然后一编译就出现这样错误(并不是一定会出这样错误),开始以为是网上下载的类库本身问题,所以重新找类库或者其他方式将它添加进去,只要不出错就行,也一直没有深入了解根本问题,今天在给工程添加一个FMDB(SQLIte第三方类库)文件编译时又出现这种错误,一开始以为工程问题,但是新建工程后还是出现这个问题,经过网上查找,得到了解决办法;
[cpp] view plaincopy
- Undefined symbols for architecture i386:
- "_OBJC_CLASS_$_FMDatabase", referenced from:
- objc-class-ref in ViewController.o
- ld: symbol(s) not found for architecture i386
- clang: error: linker command failed with exit code 1 (use -v to see invocation)

在网上得到解决办法是:
在工作左边导航栏Target-->Build Phases-->compile Sources中,第三库库的所有.m文件都添加到里面,然后编译通过了;

添加.m文件

根据对比可以看见 in FMDBTest,FMDBTest的Target里添加进去了了一些.m文件

对于以上错误,根据网友解答我的理解是
我们在使用这些第三方类库文件时直接将其拖拽到工程之中,编译的的时候Xcode也没有自动引用,所以造成这样错误,这就需要我们手动添加。假如我们在工程中新建某个文件就不会出现这样问题;
参考 http://blog.hsin.tw/2012/ios-dev-undefined-symbols-for-architecture-i386/
情况2、
linker command failed with exit code 1 (use -v to see invocation)
出现这种情况很可能是,项目中引入了多个相同的文件。删除一个就ok!
情况3、
xcoder的一个编译错误:
linker command failed with exit code 1 (use -v to see invocation)
说明有无法准确找到的函数,函数有重复现象。
造成这个错误的原因是我直接在 .h头文件中实现了几个函数,然后这个头文件又被别的.c文件所引用,有实现的。
所以解决办法是把实现的几个函数单出一个.c文件里去。这样就ok了。
情况4、
把 Valid Architectures 的值改为 armv7
过程:
PROJECT --> Build Settings --> Architectures --> Valid Architectures 他的值本来是 armv7 armv7s (ios6.0下) 把armv7s 去掉即可
同样的操作
TARGETS --> Build Settings --> Architectures --> Valid Architectures 做同样的修改
情况5、 很奇葩的情况啊,就是引用第三方的静态库.a 出现了问题. 在模拟器和真机引入的静态库是分开的!!!当然如果你的静态库做成了统一的,那就不会出现情况5.
linker command failed with exit code 1的更多相关文章
- Xcode出现( linker command failed with exit code 1)错误总结
这种问题,通常出现在添加第三方库文件或者多人开发时. 这种问题一般是找不到文件而导致的链接错误. 我们可以从如下几个方面着手排查. 先可以再试试一下几个方法: 1,看看是不是有新添加的文件跟之前文件 ...
- 出现( linker command failed with exit code 1)错误总结 (转)
这种问题,通常出现在添加第三方库文件或者多人开发时. 这种问题一般是找不到文件而导致的链接错误. 我们可以从如下几个方面着手排查. 1.以如下错误为例,如果是多人开发,你同步完成后发现出现如下的错误. ...
- symbol(s) not found for architecture x86_64 之 linker command failed with exit code 1 (use -v to see invocation)解决方案排查
这样的错误 ,我的解决方案是, 第一种: 查看他说在 ****.o 中,你要查看这样的关键点,然后去查看,你 项目中有没有引进这样的文件,在项目中查找,看项目中有没有,如果没有那就是没添加进来,你 ...
- linker command failed with exit code 1 (use -v to see invocation)
背景:用U盘从另一台电脑考过来后,出现错误 linker command failed with exit code 1 (use -v to see invocation) 出现这种情况很可能是,项 ...
- 出现( linker command failed with exit code 1)错误总结
这种问题,通常出现在添加第三方库文件或者多人开发时. 这种问题一般是找不到文件而导致的链接错误. 我们可以从如下几个方面着手排查. 1.以如下错误为例,如果是多人开发,你同步完成后发现出现如下的错误. ...
- linker command failed with exit code 1 (use -v to see invocation)解决办法
[cpp] view plaincopy Undefined symbols for architecture i386: "_OBJC_CLASS_$_FMDatabase&quo ...
- Undefined symbols for architecture x86_64: ( linker command failed with exit code 1)
当出现 linker command failed with exit code 1 (use -v to see invocation) 的错误总结,具体内容如下: Undefined symbo ...
- error: linker command failed with exit code 1 解决方法之一
出现这种错误的原因可能很多,以下是我遇到的一种情况: 向项目中添加了新文件,没有加入compile source 编译报错: ld: symbol(s) not found for architect ...
- clang: error: linker command failed with exit code 1 (use -v to see invocation)
报错提示: ... ld: 6 duplicate symbols for architecture x86_64 clang: error: linker command failed with e ...
- IOS Bugs5 linker command failed with exit code 1 (use -v to see invocation)
Ld /Users/Rubert/Library/Developer/Xcode/DerivedData/OC_Language-emftyzftyvhdpuaxipddjmpnpvox/Build/ ...
随机推荐
- app启动其他应用
因开发需要内包一个app,所以要启动一个app,这种操作 如果知道包名和类名 其实很简单 只需要将包名内嵌即可(一般情况 我们都可以解压或者反接拿到) 代码如下: Intent intent = ne ...
- android 22 启动带2个action值的预定义acticity
main.xml <LinearLayout xmlns:android="http://schemas.android.com/apk/res/android" andro ...
- android 19 activity纵横屏切换的数据保存与恢复
Bundle类:竖屏的activity换到横屏的activity的时候,会把竖屏的activity杀掉横屏的activity创建,竖屏的activity会有一些计算结果,可以用数据存起来,存到内存里面 ...
- mysql 异常处理实例
1. 语法: DECLARE handler_action HANDLER FOR condition_value [, condition_value] ... statement handler_ ...
- linux中echo的用法 分类: 学习笔记 linux ubuntu 2015-07-14 14:27 21人阅读 评论(0) 收藏
1.echo命令我们常用的选项有两个,一个是-n,表示输出之后不换行,另外一个是-e,表示对于转义字符按相应的方式处理,如果不加-e那么对于转义字符会按普通字符处理. 2.echo输出时的转义字符 \ ...
- Java——(六)Collection之Queue集合
------Java培训.Android培训.iOS培训..Net培训.期待与您交流! ------- Queue集合 Queue集合用于模拟队列这种数据结构,队列通常是指“先进先出‘(FIFO)的容 ...
- Oracler读取各种格式的相关日期格式
CREATE OR REPLACE Package Pkg_Stm_Date As --Purpose:相关日期处理功能包 --获取某一天是第几周 Function ...
- htmlentities() 函数
Definition and Usage定义和用法 The htmlentities() function converts characters to HTML entities.htmlentit ...
- 第七篇: python高级之多线程
21 interest=0.05 22 count=amount+amount*interest 23 24 self.withdraw(count) 25 26 27 def transfer(_f ...
- bash: ./configure: 权限不够 怎么办?
configure没有执行权限 通过chmod给其加上x权限 chmod +x configure 再在该用户下执行 ./configure