Android studio升级后原有项目无法正常编译运行问题
Android studio工具升级后Gradle版本问题
背景
升级AndroidStudio到最新版本后,原来可正常编译输出AndroidTest的项目无法正常编译通过。
原因
升级后的Androidstudio版本对gradle版本具有一定要求,原有项目配置信息无法满足项目编译需要。
修改方案
修改项目级gradle配置文件:
1、通过当前工具新建Android工程
2、根据新建工程project下build.gradle文件内容修改现有项目配置
buildscript {
repositories {
google()
jcenter()
}
dependencies {
//需同步配置
classpath 'com.android.tools.build:gradle:3.2.0'
// NOTE: Do not place your application dependencies here; they belong
// in the individual module build.gradle files
}
}
3、根据新建项目中gradle/wrapper/gradle-wrapper.properties的gradle版本设置原有项目。
#Wed Aug 22 18:11:36 GMT+08:00 2018
distributionBase=GRADLE_USER_HOME
distributionPath=wrapper/dists
zipStoreBase=GRADLE_USER_HOME
zipStorePath=wrapper/dists
distributionUrl=https\://services.gradle.org/distributions/gradle-4.6-all.zip
以上配置完成后再次运行打包任务即可正常运行,每个项目的具体情况有可能有所不同,但是解决思路大体一致。
附异常信息:
AGPBI: {"kind":"error","text":"Illegal class file: Class module-info is missing a super type.","sources":[{"file":"C:\\Users\\Administrator\\.gradle\\caches\\modules-2\\files-2.1\\net.bytebuddy\\byte-buddy-agent\\1.9.0\\37b5703b4a6290be3fffc63ae9c6bcaaee0ff856\\byte-buddy-agent-1.9.0.jar"}],"tool":"D8"}
AGPBI: {"kind":"error","text":"Illegal class file: Class module-info is missing a super type.","sources":[{"file":"C:\\Users\\Administrator\\.gradle\\caches\\modules-2\\files-2.1\\net.bytebuddy\\byte-buddy\\1.9.0\\8cb0d5baae526c9df46ae17693bbba302640538b\\byte-buddy-1.9.0.jar"}],"tool":"D8"}
com.android.builder.dexing.DexArchiveBuilderException: com.android.builder.dexing.DexArchiveBuilderException: Failed to process C:\Users\Administrator\.gradle\caches\modules-2\files-2.1\net.bytebuddy\byte-buddy-agent\1.9.0\37b5703b4a6290be3fffc63ae9c6bcaaee0ff856\byte-buddy-agent-1.9.0.jar
at sun.reflect.NativeConstructorAccessorImpl.newInstance0(Native Method)
at sun.reflect.NativeConstructorAccessorImpl.newInstance(NativeConstructorAccessorImpl.java:62)
at sun.reflect.DelegatingConstructorAccessorImpl.newInstance(DelegatingConstructorAccessorImpl.java:45)
at java.lang.reflect.Constructor.newInstance(Constructor.java:423)
at java.util.concurrent.ForkJoinTask.getThrowableException(ForkJoinTask.java:593)
at java.util.concurrent.ForkJoinTask.reportException(ForkJoinTask.java:677)
at java.util.concurrent.ForkJoinTask.join(ForkJoinTask.java:720)
at com.android.ide.common.internal.WaitableExecutor.waitForTasksWithQuickFail(WaitableExecutor.java:146)
at com.android.build.gradle.internal.transforms.DexArchiveBuilderTransform.transform(DexArchiveBuilderTransform.java:308)
at com.android.build.gradle.internal.pipeline.TransformTask$2.call(TransformTask.java:221)
at com.android.build.gradle.internal.pipeline.TransformTask$2.call(TransformTask.java:217)
at com.android.builder.profile.ThreadRecorder.record(ThreadRecorder.java:102)
at com.android.build.gradle.internal.pipeline.TransformTask.transform(TransformTask.java:212)
at sun.reflect.NativeMethodAccessorImpl.invoke0(Native Method)
at sun.reflect.NativeMethodAccessorImpl.invoke(NativeMethodAccessorImpl.java:62)
at sun.reflect.DelegatingMethodAccessorImpl.invoke(DelegatingMethodAccessorImpl.java:43)
at java.lang.reflect.Method.invoke(Method.java:498)
at org.gradle.internal.reflect.JavaMethod.invoke(JavaMethod.java:73)
at org.gradle.api.internal.project.taskfactory.IncrementalTaskAction.doExecute(IncrementalTaskAction.java:50)
at org.gradle.api.internal.project.taskfactory.StandardTaskAction.execute(StandardTaskAction.java:39)
at org.gradle.api.internal.project.taskfactory.StandardTaskAction.execute(StandardTaskAction.java:26)
at org.gradle.api.internal.tasks.execution.ExecuteActionsTaskExecuter$1.run(ExecuteActionsTaskExecuter.java:124)
at org.gradle.internal.progress.DefaultBuildOperationExecutor$RunnableBuildOperationWorker.execute(DefaultBuildOperationExecutor.java:336)
at org.gradle.internal.progress.DefaultBuildOperationExecutor$RunnableBuildOperationWorker.execute(DefaultBuildOperationExecutor.java:328)
at org.gradle.internal.progress.DefaultBuildOperationExecutor.execute(DefaultBuildOperationExecutor.java:199)
at org.gradle.internal.progress.DefaultBuildOperationExecutor.run(DefaultBuildOperationExecutor.java:110)
at org.gradle.api.internal.tasks.execution.ExecuteActionsTaskExecuter.executeAction(ExecuteActionsTaskExecuter.java:113)
at org.gradle.api.internal.tasks.execution.ExecuteActionsTaskExecuter.executeActions(ExecuteActionsTaskExecuter.java:95)
at org.gradle.api.internal.tasks.execution.ExecuteActionsTaskExecuter.execute(ExecuteActionsTaskExecuter.java:73)
at org.gradle.api.internal.tasks.execution.OutputDirectoryCreatingTaskExecuter.execute(OutputDirectoryCreatingTaskExecuter.java:51)
at org.gradle.api.internal.tasks.execution.SkipUpToDateTaskExecuter.execute(SkipUpToDateTaskExecuter.java:59)
at org.gradle.api.internal.tasks.execution.ResolveTaskOutputCachingStateExecuter.execute(ResolveTaskOutputCachingStateExecuter.java:54)
at org.gradle.api.internal.tasks.execution.ValidatingTaskExecuter.execute(ValidatingTaskExecuter.java:59)
at org.gradle.api.internal.tasks.execution.SkipEmptySourceFilesTaskExecuter.execute(SkipEmptySourceFilesTaskExecuter.java:101)
at org.gradle.api.internal.tasks.execution.FinalizeInputFilePropertiesTaskExecuter.execute(FinalizeInputFilePropertiesTaskExecuter.java:44)
at org.gradle.api.internal.tasks.execution.CleanupStaleOutputsExecuter.execute(CleanupStaleOutputsExecuter.java:91)
at org.gradle.api.internal.tasks.execution.ResolveTaskArtifactStateTaskExecuter.execute(ResolveTaskArtifactStateTaskExecuter.java:62)
at org.gradle.api.internal.tasks.execution.SkipTaskWithNoActionsExecuter.execute(SkipTaskWithNoActionsExecuter.java:59)
at org.gradle.api.internal.tasks.execution.SkipOnlyIfTaskExecuter.execute(SkipOnlyIfTaskExecuter.java:54)
at org.gradle.api.internal.tasks.execution.ExecuteAtMostOnceTaskExecuter.execute(ExecuteAtMostOnceTaskExecuter.java:43)
at org.gradle.api.internal.tasks.execution.CatchExceptionTaskExecuter.execute(CatchExceptionTaskExecuter.java:34)
at org.gradle.execution.taskgraph.DefaultTaskGraphExecuter$EventFiringTaskWorker$1.run(DefaultTaskGraphExecuter.java:256)
at org.gradle.internal.progress.DefaultBuildOperationExecutor$RunnableBuildOperationWorker.execute(DefaultBuildOperationExecutor.java:336)
at org.gradle.internal.progress.DefaultBuildOperationExecutor$RunnableBuildOperationWorker.execute(DefaultBuildOperationExecutor.java:328)
at org.gradle.internal.progress.DefaultBuildOperationExecutor.execute(DefaultBuildOperationExecutor.java:199)
at org.gradle.internal.progress.DefaultBuildOperationExecutor.run(DefaultBuildOperationExecutor.java:110)
at org.gradle.execution.taskgraph.DefaultTaskGraphExecuter$EventFiringTaskWorker.execute(DefaultTaskGraphExecuter.java:249)
at org.gradle.execution.taskgraph.DefaultTaskGraphExecuter$EventFiringTaskWorker.execute(DefaultTaskGraphExecuter.java:238)
at org.gradle.execution.taskgraph.DefaultTaskPlanExecutor$TaskExecutorWorker.processTask(DefaultTaskPlanExecutor.java:123)
at org.gradle.execution.taskgraph.DefaultTaskPlanExecutor$TaskExecutorWorker.access$200(DefaultTaskPlanExecutor.java:79)
at org.gradle.execution.taskgraph.DefaultTaskPlanExecutor$TaskExecutorWorker$1.execute(DefaultTaskPlanExecutor.java:104)
at org.gradle.execution.taskgraph.DefaultTaskPlanExecutor$TaskExecutorWorker$1.execute(DefaultTaskPlanExecutor.java:98)
at org.gradle.execution.taskgraph.DefaultTaskExecutionPlan.execute(DefaultTaskExecutionPlan.java:663)
at org.gradle.execution.taskgraph.DefaultTaskExecutionPlan.executeWithTask(DefaultTaskExecutionPlan.java:597)
at org.gradle.execution.taskgraph.DefaultTaskPlanExecutor$TaskExecutorWorker.run(DefaultTaskPlanExecutor.java:98)
at org.gradle.internal.concurrent.ExecutorPolicy$CatchAndRecordFailures.onExecute(ExecutorPolicy.java:63)
at org.gradle.internal.concurrent.ManagedExecutorImpl$1.run(ManagedExecutorImpl.java:46)
at java.util.concurrent.ThreadPoolExecutor.runWorker(ThreadPoolExecutor.java:1149)
at java.util.concurrent.ThreadPoolExecutor$Worker.run(ThreadPoolExecutor.java:624)
at org.gradle.internal.concurrent.ThreadFactoryImpl$ManagedThreadRunnable.run(ThreadFactoryImpl.java:55)
at java.lang.Thread.run(Thread.java:748)
Caused by: com.android.builder.dexing.DexArchiveBuilderException: Failed to process C:\Users\Administrator\.gradle\caches\modules-2\files-2.1\net.bytebuddy\byte-buddy-agent\1.9.0\37b5703b4a6290be3fffc63ae9c6bcaaee0ff856\byte-buddy-agent-1.9.0.jar
at com.android.build.gradle.internal.transforms.DexArchiveBuilderTransform.launchProcessing(DexArchiveBuilderTransform.java:805)
at com.android.build.gradle.internal.transforms.DexArchiveBuilderTransform.lambda$convertToDexArchive$8(DexArchiveBuilderTransform.java:730)
at java.util.concurrent.ForkJoinTask$AdaptedCallable.exec(ForkJoinTask.java:1424)
at java.util.concurrent.ForkJoinTask.doExec(ForkJoinTask.java:289)
at java.util.concurrent.ForkJoinPool$WorkQueue.runTask(ForkJoinPool.java:1056)
at java.util.concurrent.ForkJoinPool.runWorker(ForkJoinPool.java:1692)
at java.util.concurrent.ForkJoinWorkerThread.run(ForkJoinWorkerThread.java:157)
Caused by: com.android.builder.dexing.DexArchiveBuilderException: Error while dexing.
at com.android.builder.dexing.D8DexArchiveBuilder.getExceptionToRethrow(D8DexArchiveBuilder.java:175)
at com.android.builder.dexing.D8DexArchiveBuilder.convert(D8DexArchiveBuilder.java:152)
at com.android.build.gradle.internal.transforms.DexArchiveBuilderTransform.launchProcessing(DexArchiveBuilderTransform.java:800)
... 6 more
Caused by: com.android.tools.r8.CompilationFailedException: Compilation failed to complete
at com.android.tools.r8.utils.ExceptionUtils.withCompilationHandler(ExceptionUtils.java:76)
at com.android.tools.r8.utils.ExceptionUtils.withD8CompilationHandler(ExceptionUtils.java:45)
at com.android.tools.r8.D8.run(D8.java:88)
at com.android.builder.dexing.D8DexArchiveBuilder.convert(D8DexArchiveBuilder.java:147)
... 7 more
Caused by: com.android.tools.r8.utils.AbortException
at com.android.tools.r8.utils.Reporter.failIfPendingErrors(Reporter.java:77)
at com.android.tools.r8.utils.Reporter.fatalError(Reporter.java:58)
at com.android.tools.r8.utils.ExceptionUtils.withCompilationHandler(ExceptionUtils.java:67)
... 10 more
:crawler:transformClassesWithDexBuilderForDebugAndroidTest FAILED
FAILURE: Build failed with an exception.
* What went wrong:
Execution failed for task ':_crawler:transformClassesWithDexBuilderForDebugAndroidTest'.
> com.android.build.api.transform.TransformException: com.android.builder.dexing.DexArchiveBuilderException: com.android.builder.dexing.DexArchiveBuilderException: Failed to process C:\Users\Administrator\.gradle\caches\modules-2\files-2.1\net.bytebuddy\byte-buddy-agent\1.9.0\37b5703b4a6290be3fffc63ae9c6bcaaee0ff856\byte-buddy-agent-1.9.0.jar
* Try:
Run with --stacktrace option to get the stack trace. Run with --info or --debug option to get more log output. Run with --scan to get full insights.
* Get more help at https://help.gradle.org
BUILD FAILED in 8s
Android studio升级后原有项目无法正常编译运行问题的更多相关文章
- Android Studio升级后projectBuild failed.
近期在升级Android Studio后,发现原先能编译通过的project,突然就编译只是了,原因是生成的AndroidManifest.xml文件里有乱码. 升级后: android studio ...
- Android Studio升级后,开启时遇到tools.jar seems to be not in Android Studio错误?
工作半年多,电子工程小白一枚.今天上班的时候,与几位同事聊到博客的问题.平时都是在别人的博客里找到问题的解决之妙法, 今天一个冲动之下,我决定也开始用博客记录工作的点滴,暂且当作笔记一用. 出于工作需 ...
- Android Studio升级到3.1.4后打开旧项目警告:The `android.dexOptions.incremental` property is deprecated and it has no effect on the build process.
现象截图 问题原因&解决方案 在build.gralde中,对Android开发过程中突破的方法数的限制,做了如下解决配置: dexOptions { incremental true jav ...
- android studio 升级到3.3.1后,提示程序包不存在
android studio 升级到3.3.1后,提示程序包不存在 原因 主Module--A 引用了其他Moduel--B里的jar库, 只需要把B的dependencies改成如下(implent ...
- Android Studio 升级到3.0后出现编译错误\.gradle\caches\transforms-1\files-1.1\*****-release.aar
Android Studio 升级到3.0后出现各种编译问题,其中有一个问题是关于资源找不到的问题,百度了半天,也没有相关的文章 C:\Users.gradle\caches\transforms-1 ...
- Android Studio 升级到3.0 提示 java.lang.NoClassDefFoundError
Android Studio 升级到3.0 提示 java.lang.NoClassDefFoundError 这个问题折腾了2个小时,最后解决了,Stack Overflow 上也有一次类似的问题, ...
- [转]Android Studio创建Xposed模块项目时BridgeApi的正确添加方式
使用Android Studio创建的空项目作为Xposed Module App,对于Api Jar包的引用方式,一开始是按照傻瓜式Jar Lib的处理方式,复制XposedBridgeApi-54 ...
- Android Studio 升级为3.1 踩到的坑
原文:https://blog.csdn.net/xiariluoxue/article/details/80050700 AndroidStudio.gradle.buildToolsVersion ...
- Android Studio安装后提示No JVM installation found解决办法
Android Studio安装后提示No JVM installation found解决办法 问题描述:Android Studio安装完毕,打开时出现提示"No JVM install ...
随机推荐
- swift 笔记 (二十一) —— 高级运算符
高级运算符 位运算符 按位取反: ~ 按位与运算: & 按位或运算: | 按位异或运算: ^ 按位左移运算: << 按位右移动算: >> 溢出运算符 自从swif ...
- beego3---gohttp底层实现
package main //gohttp底层实现,通过gohttp不是通过beego实现的输出 // import ( "io" "log" "ne ...
- ios20--xib2
故事板控制器: // // ViewController.m // 03-通过xib自定义商品的View #import "ViewController.h" #import &q ...
- Java 技术体系(JDK 与 JRE 的关系)、POJO 与 JavaBeans
Java 技术体系的分层结构(不同的颜色表示不同的层次),尤其注意 JDK 与 JRE 之间的包含关系: 图见 Java Platform Standard Edition 7 Documentati ...
- BZOJ_4800_[Ceoi2015]Ice Hockey World Championship_双指针
BZOJ_4800_[Ceoi2015]Ice Hockey World Championship_双指针 Description 有n个物品,m块钱,给定每个物品的价格,求买物品的方案数. Inpu ...
- POJ1584 A Round Peg in a Ground Hole 凸包判断 圆和凸包的关系
POJ1584 题意:给定n条边首尾相连对应的n个点 判断构成的图形是不是凸多边形 然后给一个圆 判断圆是否完全在凸包内(相切也算) 思路:首先运用叉积判断凸多边形 相邻三条边叉积符号相异则必有凹陷 ...
- javascript DOM基本操作
javascript DOM基本操作 1.DOM(Document Object Model 文档对象模型) 2.节点: 文档节点:document 元素节点:html.head.body.title ...
- bzoj 1914: [Usaco2010 OPen]Triangle Counting 数三角形【叉积+极角排序+瞎搞】
参考:https://blog.csdn.net/u012288458/article/details/50830498 有点神啊 正难则反,考虑计算不符合要求的三角形.具体方法是枚举每个点,把这个点 ...
- iOS 项目中的常见文件
iOS的笔记-项目中的常见文件 新建一个项目之后,有那么多的文件,下面介绍一下主要的几个. 1.文件名 (1)AppDelegate UIApplication的代理,app收到干扰的时候,进行处 ...
- Laravel5.1学习笔记23 Eloquent 序列化
Eloquent: Serialization Introduction Basic Usage Hiding Attributes From JSON Appending Values To JSO ...