1.java.util.concurrent.ExecutionException: org.apache.catalina.LifecycleException: Failed to start component [StandardEngine[Catalina].StandardHost[localhost].StandardContext]

报错详细信息

at java.util.concurrent.FutureTask.report(FutureTask.java:122)
 at java.util.concurrent.FutureTask.get(FutureTask.java:192)
 at org.apache.catalina.core.ContainerBase.startInternal(ContainerBase.java:1233)
 at org.apache.catalina.core.StandardHost.startInternal(StandardHost.java:819)
 at org.apache.catalina.util.LifecycleBase.start(LifecycleBase.java:145)
 at org.apache.catalina.core.ContainerBase$StartChild.call(ContainerBase.java:1694)
 at org.apache.catalina.core.ContainerBase$StartChild.call(ContainerBase.java:1684)
 at java.util.concurrent.FutureTask.run(FutureTask.java:266)
 at java.util.concurrent.ThreadPoolExecutor.runWorker(ThreadPoolExecutor.java:1142)
 at java.util.concurrent.ThreadPoolExecutor$Worker.run(ThreadPoolExecutor.java:617)
 at java.lang.Thread.run(Thread.java:745)

解决方法

修改tomcat下的文件catalina.properties

tomcat.util.scan.DefaultJarScanner.jarsToSkip=\ 后加 *

Tomcat报错合集的更多相关文章

  1. Jenkins 报错合集

    目录 一.启动项目显示,没有接受许可之前不能够自动安装 二.明明配置了jdk但还是说找不到 三.jenkins-RestAPI调用出现Error 403 No valid crumb was incl ...

  2. Redis cluster 集群报错合集

    目录 一.连接集群操作报错(error)MOVED 二.集群关闭后重启报错 三.Redis (error) NOAUTH Authentication required 四.Redis集群使用中突然挂 ...

  3. vc++6.0各种报错合集(附:VC++6.0调出打印窗口的方法)

    背景: 由于VC++6.0对于现在的我来说,只是一个工具,暂时没有太多的时间分配到这块去深究它,由于不明其原理,因此也只是在此把错误积累下来,以备下次相同错误出现时能快速排除,节省时间. 正文 一.出 ...

  4. Mysql报错合集

    目录 一.链接报错 客户端连接mysql出错 链接客户端出错 交互登陆mysql出现warning警告Using a password 导入数据到数据库报错ERROR 1050 登陆数据库提示-bas ...

  5. python报错合集

    哈喽,大家好呀 我又来啦,今天让我们来看看python中有哪些常见的异常报错吧 说到python中的报错,我们总是脑壳疼现在我们要学会去认识报错的类型 这样子,在我们出现报错的时候就可以知道报错的原因 ...

  6. ERRORS !MySQL 和 Javaweb 的报错合集

    ERROR:1175. You are using safe update mode and you tried to update a table without a WHERE that uses ...

  7. MySQL报错合集解决办法: server has gone away, @@GLOBAL.GTID_PURGED can only be set when @@GLOBAL.GTID_MODE = ON

    server has gone away: 如下图 执行以下命令 show global variables like '%timeout%'; set global interactive_time ...

  8. maven 项目启动tomcat报错 java.lang.ClassNotFoundException: org.springframework.web.context.ContextLoaderListener

    maven项目启动tomcat报错: java.lang.ClassNotFoundException: org.springframework.web.context.ContextLoaderLi ...

  9. 【转】Eclipse下启动tomcat报错:/bin/bootstrap.jar which is referenced by the classpath, does not exist.

    转载地址:http://blog.csdn.net/jnqqls/article/details/8946964 1.错误: 在Eclipse下启动tomcat的时候,报错为:Eclipse下启动to ...

随机推荐

  1. Js:弹窗剧中

    js变量设置 var iWidth = $(window).width() * 0.9; var iHeight = $(window).height() * 0.9; - iHeight) / ; ...

  2. CAS配置(1)SSL证书配置

    一.配置源码 源码配置稍后提供 二.系统环境安装 安装JDK配置,版本>=1.7 环境变量配置(参考): JAVA_HOME=C:\Program Files x86)\Java\jdk1.7. ...

  3. 使用node成功安装完某插件typescript后,在使用时提示:tsc(或xxx)不是内部或外部命令,也不是可运行的程序或批处理文件

    具体出错情形: 使用npm安装typescript明明安装成功,但在使用时一直报错,报错语句为  tsc不是内部或外部命令,也不是可运行的程序或批处理文件 具体出错原因: node未正确安装,或相关环 ...

  4. ROS-TF-新建坐标系

    前言:在前面的试验中,我们分别有wolrd,turtle1和turtle2三个坐标系,并且world是turtle1和turtle2的父坐标系.现在我们来新建一个自定义坐标系,让turtle2跟着新的 ...

  5. 2015 多校赛 第二场 1006 (hdu 5305)

    Problem Description There are n people and m pairs of friends. For every pair of friends, they can c ...

  6. python--3、函数

    定义: 定义函数时,也相当于定义变量.会把函数体内的代码存入开辟的内存空间中.使用函数时,通过func() 声明是函数,其对应的值为代码.函数是指将一组语句的集合通过一个名字(函数名)封装起来,要想执 ...

  7. Caffe2:ubuntuKylin17.04使用Caffe2.LSTM

    一早发现caffe2的较成熟的release版发布了(the first production-ready release),那么深度学习平台在之后一段时间也是会出现其与tensorflow相互竞争的 ...

  8. QT4使用HDF5 类型错误

    使用HDF5 :HDF5_1.10.0 出现: fatal error C1083: 无法打开包括文件:"stdbool.h": No such file or directory ...

  9. 安卓代码迁移:ActionBarActivity: cannot be resolved to a type

    参考链接:http://stackoverflow.com/questions/18830736/actionbaractivity-cannot-be-resolved-to-a-type in e ...

  10. 06--c++友元类

    =======================什么是友元类======================= 当一个类B成为了另外一个类A的“朋友”时,那么类A的私有和保护的数据成员就可以被类B访问.我们 ...