问题描述: 在有几台电脑上pip install paramike报错

报错内容:

Could not find a version that satisfies the requirement sqlmap(from versions:)No matching distribution found for sqlmap

Could not fetch URL https://pypi.python.org/simple/pip/: There was a problem confirming the ssl certificate: [SSL: CERTIFICATE_VERIFY_FAILED] certificate verify failed (_ssl.c:590) - skipping
Requirement already up-to-date: pip in /usr/local/lib/python2.7/dist-packages/pip-9.0.1-py2.7.egg

ReadTimeoutError: HTTPSConnectionPool(host='pypi.python.org', port=443):Read timed out

解决方法:

使用豆瓣源安装

pip install paramike -i https://pypi.doubanio.com/simple/ --trusted-host pypi.doubanio.com

2018-08-01 安装stomp库下载报错,采用豆瓣源安装解决

pip install stomp.py -i https://pypi.doubanio.com/simple/ --trusted-host pypi.doubanio.com

Python3.6.2安装pip install paramike模块报错的更多相关文章

  1. pip install selenium==版本号 报错

    安装selenium是注意不要带版本号直接用如下命令: pip install selenium

  2. centos安装pip,zipimport.ZipImportError报错

    安装pip下载pip安装包wget https://bootstrap.pypa.io/get-pip.py 执行以下报错 python get-pip.py ##报错内容(zipimport.Zip ...

  3. python pip install XXX出现报错问题

    重装Anacondas后,将pip 和python.exe路径加入到环境变量后直接在cmd窗口进行pip 操作,报错如下 报错内容为: pip is configured with locations ...

  4. pip install urllib3[secure] 报错 error: ffi.h: No such file or directory

    解决 sudo apt-get install build-essential autoconf libtool pkg-config python-opengl python-imaging pyt ...

  5. python pip安装模块报错 "Can't connect to HTTPS URL because the SSL module is not available."

    在升级python版本为3.6之后,pip安装模块报错. 报错信息如图: 原因是系统自带的openssl版本与python3的版本不匹配,所以这里只要升级openssl版本就可以解决问题. yum - ...

  6. pycharm安装 suds模块报错:AttributeError: module 'pip' has no attribute 'main'

    需求:安装suds模块 遇到的问题: 一.报错信息:[file][Default Settint]---Project Interpreter 点击 搜索suds安装模块报错 解决:依据上图提示找到C ...

  7. 同时安装Python2与Python3,安装第三方包,老是报错

    同时安装Python2与Python3,安装第三方包,老是报错提示Fatal error in launcher: Unable to create process using '"',那可 ...

  8. redhat 6安装python 3.7.4报错ModuleNotFoundError: No module named '_ctypes' make: *** [install] Error 1

    问题描述: 今天在测试环境中,为了执行脚本,安装下python3命令,在执行make install的时候报错: ModuleNotFoundError: No module named '_ctyp ...

  9. python 安装模块报错 response.py", line 302, in _error_catcher

    python 安装模块报错 Exception:Traceback (most recent call last): File "/usr/share/python-wheels/urlli ...

随机推荐

  1. 学习Spring中遇到关于BeanFactory及测试类的问题

    最近在学习Spring,使用的是Spring 5.0.1 学习书本中使用的是4.0 学习书本中使用以下来加载配置文件及设置 Resource resource = new ClassPathResou ...

  2. Oracle编码

    三.解决数据库乱码原理特辑内容 3.1 前言 在解决数据库乱码问题中,涉及到三个方面的字符集:1.oracel server端的字符集:2.oracle client端的字符集:3.dmp文件的字符集 ...

  3. 清除cookie

    function clearCookie(){ if(document.cookie.length < 2048){ return; } //cookie大于2kb,清除cookie var c ...

  4. caffe: c++11支持

    1)在Makefile中400行左右, CXXFLAGS += -MMD -MP  改成:CXXFLAGS += -MMD -MP -std=c++0x,好像还改了不少地方,有的是 -std=c++1 ...

  5. win10磁盘/cpu占用100%问题

    https://www.zhihu.com/question/27664545 https://www.zhihu.com/question/27664545 微软自己的解决办法 https://su ...

  6. Python学习之路基础篇--05Python基础+列表和元组

    1 list # 增 city = ["wuhan", "shanghai", "chongqing", "changsha&qu ...

  7. Oracle 批量增加 / 批量跟新

    在使用oracl过程中踩到好多坑,在此记录,也分享给大家. 第一:批量插入 代码一(在为明确表和字段的情况下,动态批量增加): @Insert("<script> " ...

  8. Valudate.js格式

    jQuery(function($) { $("#form").validate({ rules:{ username:{required:true }, Loginname:{ ...

  9. .NET数据采集

    public string GetHttpData(string Url) { string sException = null; string sRslt = null; WebResponse o ...

  10. JQ方法实用案例///鼠标移动到div和修改ipt中弹窗、CSS鼠标变小手、JQ获取元素属性、JQ选择器

    今天学习了jQ,jQ对js的帮助很大,菜鸟教程上也有属性.可以查看 js 和 jquery主要的区别 在 dom    想用jquery  必须先引入(顺序问题)        先css 再js:   ...