解决方法是将 jre的目录在 window->Preferences 里修改java installed里的jre目录改为jdk目录即可。

原因是在jre目录下不存在tools.jar.

maven错误解决一:Failed to execute goal org.apache.maven.plugins:maven-compiler-plugin:2.5.1:compile (default-compile)的更多相关文章

  1. Maven创建项目: Failed to execute goal org.apache.maven.plugin( mvn archetype:create)

    一.概述: 在使用mvn 命令mvn archetype:create -DgroupId=com.chuanliu.c11 -DartifactId=c11searcher在控制创建maven项目和 ...

  2. maven build时报错Failed to execute goal org.apache.maven.plugins:maven-surefire-plugin:2.12.4:test

    [INFO] BUILD FAILURE [INFO] ------------------------------------------------------------------------ ...

  3. maven install时报错 Failed to execute goal org.apache.maven.plugins:maven-surefire-plugin:2.12.4:test (default-test)

    今天在一个maven项目上执行maven install命令的时候一直报错,错误信息如下: [INFO] ----------------------------------------------- ...

  4. git 打包报错:Maven Build时提示:Failed to execute goal org.apache.maven.plugins:maven-surefire-plugin:2.12.4:test

    1.使用git 升级 服务命令 mvn  deploy -e 之后报错: Failed to execute goal org.apache.maven.plugins:maven-surefire- ...

  5. maven install 报错Failed to execute goal org.apache.maven.plugins:maven-compiler-plugin:3.1:compile (default-compile) on project*****

    [ERROR]Failed to execute goal org.apache.maven.plugins:maven-compiler-plugin:3.1:compile (default-co ...

  6. Idea创建Maven项目时出现Failed to execute goal org.apache.maven.plugins:maven-archetype-plugin:3.0.1错误

    如果Maven中用的jre用的是idea中自带的,但是环境变量JAVA_HOME配置的是自己的jdk,那么就会出现 解决方法是到settiing中把jre改成自己的jdk中的jre 经过尝试,问题解决

  7. SpringBoot MAVEN编译报错Failed to execute goal org.apache.maven.plugins:maven-compiler-plugin:3.8.0:

    参考了好几篇文章没搞定,直到查询错误关键字 An unknown compilation problem occurred 分别参考了以下博客: https://blog.csdn.net/fanre ...

  8. maven install时报错Failed to execute goal org.apache.maven.plugins:maven-surefire-plugin:2.12.4:test

    事故现场: 解决办法: 一是命令行, mvn clean package -Dmaven.test.skip=true 二是写入pom文件, <plugin> <groupId> ...

  9. 启动Maven项目时报错Failed to execute goal org.apache.maven.plugins:maven-clean-plugin:2.5:clean (default-clean) on project **-web: Failed to clean project: Failed to delete E:\**\target\tomcat\logs\access_lo

    这类错误 出现这种错误,通常是由于您已启动了另一个tomcat 进程或者运行的javaw.exe进程,导致报错. 解决方法: 1. 鼠标点击 X 进行关闭运行失败的 Console页,(如果运行多次, ...

  10. maven install时报错Failed to execute goal org.apache.maven.plugins:maven-compiler-plugin:2.3.2:compile

    首先检查父项目,子项目的jdk版本是否一致,编码格式是否一致我的问题就错在了编码格式上,父项目用的是UTF-8,子项目新建的,默认GBK这时,使用maven install命令出错 提示:[INFO] ...

随机推荐

  1. Python 命名空间

    通俗的来说,Python中所谓的命名空间可以理解为一个容器.在这个容器中可以装许多标识符.不同容器中的同名的标识符是不会相互冲突的.理解python的命名空间需要掌握三条规则: 第一,赋值(包括显式赋 ...

  2. java socket client

    用tornado做了个socket server.无奈联调的人员对接不上. 于是撸出了以下demo import java.io.*; import java.net.*; public class ...

  3. 【K8s】Kubernetes 最近正在看的资料

    中国移动Kubernetes多集群统一管理实践:  http://www.tuicool.com/articles/FrqQrqI#c-22517 一种新的进入容器的方式: WebSocket + D ...

  4. 【leetcode】Path Sum II

    Path Sum II Given a binary tree and a sum, find all root-to-leaf paths where each path's sum equals ...

  5. mysql中表名是order的CRUD的错误

    org.springframework.jdbc.BadSqlGrammarException: ### Error querying database. Cause: com.mysql.jdbc. ...

  6. 最近开始做Android了

    最近开始做Android,在学习的过程中发现找以前知识很不方便啊,于是决定以后还是把知识记录在博客里吧,说不定也能为他人提供参考!

  7. ACM/ICPC 之 数据结构-邻接表+DP+队列+拓扑排序(TSH OJ-旅行商TSP)

    做这道题感觉异常激动,因为在下第一次接触拓扑排序啊= =,而且看了看解释,猛然发现此题可以用DP优化,然后一次A掉所有样例,整个人激动坏了,哇咔咔咔咔咔咔咔~ 咔咔~哎呀,笑岔了- -|| 旅行商(T ...

  8. [Android] ListView中如何让onClick和onItemClick事件共存

    ListView中如何使用Button,让onClick和onItemClick事件共存 假如ListView的一条记录包含一个TextView文本框,一个Button按钮,怎样能让点击按钮有事件响应 ...

  9. 【opencv】图片标注文字

    IplImage* pstImg; HI_CHAR as8Title[25];CvFont stTimeFont;//字体信息cvInitFont(&stTimeFont,CV_FONT_HE ...

  10. IOS-MVC的使用

    1.Model不允许和Controller,View打交道.也就是Model根本不知道谁会用自己,Model中不能有任何对 Controller和View的引用.正所谓:Don't call me, ...