pom文件引入以下依赖

            <plugin>
<groupId>org.apache.maven.plugins</groupId>
<artifactId>maven-surefire-plugin</artifactId>
<version>2.4.2</version>
<configuration>
<skipTests>true</skipTests>
</configuration>
</plugin>

maven install 报错 Failed to execute goal org.apache.maven.plugins:maven-surefire-plugin:2.12.4:test的更多相关文章

  1. maven install 报错Failed to execute goal org.apache.maven.plugins:maven-compiler-plugin:3.1:compile (default-compile) on project*****

    [ERROR]Failed to execute goal org.apache.maven.plugins:maven-compiler-plugin:3.1:compile (default-co ...

  2. mvn install 报错Failed to execute goal org.apache.maven.plugins:maven-compiler-plugin:2.3.2 错误: 找不到符号

    报错信息 在Eclipse中执行mvn install时,console端显示如下报错信息: [ERROR] Failed to execute goal org.apache.maven.plugi ...

  3. maven install时报错 Failed to execute goal org.apache.maven.plugins:maven-surefire-plugin:2.12.4:test (default-test)

    今天在一个maven项目上执行maven install命令的时候一直报错,错误信息如下: [INFO] ----------------------------------------------- ...

  4. maven install报错 Failed to execute goal on project my-manager-mapper: Could not resolve dependencies for project com.my:my-manager-mapper:jar:0.0.1-SNAPSHOT:

    报错信息为: [ERROR] Failed to execute goal on project my-manager-mapper: Could not resolve dependencies f ...

  5. maven install时报错Failed to execute goal org.apache.maven.plugins:maven-compiler-plugin:2.3.2:compile

    首先检查父项目,子项目的jdk版本是否一致,编码格式是否一致我的问题就错在了编码格式上,父项目用的是UTF-8,子项目新建的,默认GBK这时,使用maven install命令出错 提示:[INFO] ...

  6. SpringBoot MAVEN编译报错Failed to execute goal org.apache.maven.plugins:maven-compiler-plugin:3.8.0:

    参考了好几篇文章没搞定,直到查询错误关键字 An unknown compilation problem occurred 分别参考了以下博客: https://blog.csdn.net/fanre ...

  7. maven install时报错Failed to execute goal org.apache.maven.plugins:maven-surefire-plugin:2.12.4:test

    事故现场: 解决办法: 一是命令行, mvn clean package -Dmaven.test.skip=true 二是写入pom文件, <plugin> <groupId> ...

  8. 安装maven工程报错"Failed to execute goal on project...Could not resolve dependencies for project..."

    我在qingcheng_interface中Lifecycle目录下执行install命令后报错"Failed to execute goal on project...Could not ...

  9. maven build时报错Failed to execute goal org.apache.maven.plugins:maven-surefire-plugin:2.12.4:test

    [INFO] BUILD FAILURE [INFO] ------------------------------------------------------------------------ ...

随机推荐

  1. IE显示 “Promise”未定义,vue项目兼容ie的两种方案

    第一种方法: 直接在html中加入js链接: <script src = "https://cdn.polyfill.io/v2/polyfill.min.js">&l ...

  2. 【37.48%】【hdu 2587】How far away ?(3篇文章,3种做法,LCA之Tarjan算法)

    Time Limit: 2000/1000 MS (Java/Others) Memory Limit: 32768/32768 K (Java/Others) Total Submission(s) ...

  3. Date日期时间相关

    最近在封装一个关于时间函数的功能时,竟发现这些最基本的函数都有些生疏,于是进来来总结复习下,巩固自己记忆的同时,希望能帮助到需要的人 首先了解下日期对象相关的方法 var date = new Dat ...

  4. Nginx与PHP交互过程 + Nginx与PHP通信的两种方式

    一.Nginx与PHP交互过程的7步走(用户对动态PHP网页访问过程) step1:用户将http请求发送给nginx服务器(用户和nginx服务器进行三次握手进行TCP连接) step2:nginx ...

  5. 关于instanface的问题

    nstanceof关键字来判断某个对象是否属于某种数据类型.报错  代码如下 package cn.lijun.demo3; import cn.lijun.demo.Person;import cn ...

  6. 16.python内置函数

    Python 内置函数:https://www.runoob.com/python/python-built-in-functions.html 原文:https://www.cnblogs.com/ ...

  7. python内置模块(python标准库)

    1.time模块 掌握下面三种方式的转换 文件名不能跟系统内置模块重名!   #三种方式的转化关系 #时间戳(timestamp): 为了计时 为了减法计算   import time print(t ...

  8. Lambda函数到底是个什么

    1 什么是Lambda函数 lambda函数是指简单的代码片段,通常认为是不值得命名的函数,它不能重复使用,能方便程序员使用,增强代码可读性,降低代码出错概率. [ 捕获列表 ] (参数) -> ...

  9. 1077 互评成绩计算 (20 分)C语言

    在浙大的计算机专业课中,经常有互评分组报告这个环节.一个组上台介绍自己的工作,其他组在台下为其表现评分.最后这个组的互评成绩是这样计算的:所有其他组的评分中,去掉一个最高分和一个最低分,剩下的分数取平 ...

  10. Python PyInstaller安装和使用教程

    安装 PyInstalle Python 默认并不包含 PyInstaller 模块,因此需要自行安装 PyInstaller 模块. 安装 PyInstaller 模块与安装其他 Python 模块 ...