错误:Failed to execute goal org.scala-tools:maven-scala-plugin:2.15.2:compile (default) on project MusicProject: wrap: org.apache.commons.exec.ExecuteException: Process exited with an error: 1(Exit value: 1) -> [Help 1] 原因:idea中的scala版本高于本地windowscala版…
不多说,直接上干货! 问题详情 比如我们习惯在IDEA里打包用mvn clean package 在Scala IDEA for eclipse里出现mvn clean compile assembly:single  可能会出现Failed to execute goal org.scala-tools:maven-scala-plugin:2.15.2:compile(default) on Project DataFusion:wrap:org.apache.commons的错误. 问题原…
背景: 今天在项目根目录执行maven sonar:sonar ,报错信息如下,然后就各种的搜,折腾了多半天天也没找出解决办法,最后打算放弃时,看到一遍文章说是mysql  max_allowed_packet  的问题 Failed to execute goal org.sonarsource.scanner.maven:sonar-maven-plugin:3.4.0.905:sonar (default-cli) on project air_order_mis_new_git: Fai…
今天用maven在命令行打包项目的时候出现错误: Failed to execute goal org.apache.maven.plugins:maven-surefire-plugin:2.12.4:test (default-test) on project xxx: There are test failures. 但是项目用maven编译没问题,之前测试也都过了.从上面描述可以确定是单元测试部分有问题,然后仔细研究了错误内容,发现是因为我定义了一个测试基类,里面没有任何测试方法,抛出了…
引自:https://blog.csdn.net/xiexiangyan/article/details/107936774 遇到的问题 有一个maven项目,我clone一下最新的代码.准备打包(maven package),没想到在执行到TEST阶段报错.百思不得其解,决定跳过测试去打包,然后部署. Failed to execute goal org.apache.maven.plugins:maven-surefire-plugin:2.22.2:test (default-test)…
问题现象: 用Maven打包时,报Failed to execute goal org.apache.maven.plugins:maven-war-plugin:2.2:war错误. 原因分析: 打包时在WebContent/WEB-INF/文件夹下找不到web.xml文件. 解决方案: 如果WebContent/WEB-INF/web.xml文件存在,需要在pom.xml文件的<build>节点中,加上maven-war-plugin插件配置. <plugins> <pl…
用maven3新建一个项目时,输入的命令如下: mvn archetype:create 出现错误如下: [ERROR] Failed to execute goal org.apache.maven.plugins:maven-archetype-plugin:2.4:create (default-cli) on project standalone-pom: Unable to parse configuration of mojo org.apache.maven.plugins:mav…
1.Maven构建失败 Failed to execute goal org.apache.maven.plugins:maven-compiler-plugin: 2.3.4 :compile ( default -compile) on project oecp: Compilation failure 2.解决方法:使用自己的jdk,记住是jdk,因为jdk里本身包含jre.而不是单纯的jre.本人初学者,表达肤浅,请看勿笑.…
今天碰到一个奇怪的问题,就是我在eclipse中使用maven命令:clean package 命令打完包之后,通过FlashFXP将jar包上传到Linux服务器后,由于其他原因,我想要修改下程序重新打包,问题来了,重新打包的时候就报错了,并且我的那个存放jar包的target文件夹也被锁住了,直接打不开,会提示没有权限,下面放上截图: 1.首先我想通过给这个文件夹开放权限来解决问题,虽然我也不知道为什么突然这个文件夹就没有权限了,但是照着网络教程也没搞定权限,放弃. 2.尝试重启eclisp…
出现下面异常,因为默认web.xml在  src/main/webapp  下所以才出现找不到的异常. 我的项目结构为 解决办法①:  在pom.xml里面制定 web位置即可 //先确保打包方式为war <packaging>war</packaging> <build> <plugins> <plugin> <groupId>org.apache.maven.plugins</groupId> <artifact…
遇到这个问题看了很多博客之后发现:执行这个语句就行了:mvn clean package -Dmaven.test.skip=true 本文链接:https://blog.csdn.net/weixin_43046726/article/details/88821174…
超级折磨人 在网上搜到的解决方案: 技术交流群 : 816227112 修改 和 <plugin> <groupId>org.apache.maven.plugins</groupId> <artifactId>maven-resources-plugin</artifactId> <version>2.7</version> <dependencies> <dependency> <grou…
前言 IDEA(2020)引入Maven进行依赖管理,无法从私服上下载jar包 报如下错误 Failed to execute goal org.apache.maven.plugins:maven-compiler-plugin:3.8.1:compile 获取jar失败,编译失败. 原因分析 错误:Maven从仓库中获取jar失败 解决办法 第一步:检查Maven模式 第二步:检查 确保我们的仓库中包含该jar包,若没有,运行命令,进行手动获取jar 命令:mvn dependency:ge…
最近在使用spring-boot整合多模块,但是在父pom中打包maven install时总会报错:Failed to execute goal org.springframework.boot:spring-boot-maven-plugin,导致错误的原因是父pom.xml中引入了如下配置: <build> <plugins> <plugin> <groupId>org.springframework.boot</groupId> <…
源文URL:http://blog.csdn.net/caiwenfeng_for_23/article/details/44514947 mvn compile  没有问题,mvn package的时候报如下错误: Failed to execute goal org.apache.maven.plugins:maven-surefire-plugin:2.5:test 解决方法: 打包跳过测试有两种方法 一是命令行,mvn clean package -Dmaven.test.skip=tr…
在spring cloud服务中,有一个ms-code项目,只为所有的微服务提供核心依赖和工具类,没有业务意义,作为核心依赖使用.所以没有main方法,没有启动类. 在spring cloud整体打包的过程中报错: [INFO] --- maven-jar-plugin::jar (default-jar) @ springcloud-ms-core --- [INFO] Building jar: D:\document\IdeaProjects\springcloud\springcloud…
关于Springboot打包错误的问题 | Failed to execute goal org.springframework.boot:spring-boot-maven-plugin https://blog.csdn.net/qq_30553235/article/details/79094315(copy 最近在使用spring-boot,但是maven install时总会报错:Failed to execute goal org.springframework.boot:sprin…
通过IDEA 提供的面板 执行package 或者 install 没有错误,但是cmd terminal 窗口就不行!出现: Maven 错误:Failed to execute goal org.apache.maven.plugins:maven-compiler-plugin:3.1:compile (default-compile) on project appservice-common: Fatal error compiling: 无效的目标发行版: 1.8 后面发现是JAVA_…
mvn package的时候报如下错误: Failed to execute goal org.apache.maven.plugins:maven-surefire-plugin:2.5:test 亲测解决方法如下: 在pom文件中添加 <plugin> <groupId>org.apache.maven.plugins</groupId> <artifactId>maven-surefire-plugin</artifactId> <v…
报错内容如下: [INFO] ------------------------------------------------------------------------ [INFO] BUILD FAILURE [INFO] ------------------------------------------------------------------------ [INFO] Total time: 6.095 s [INFO] Finished at: 2018-10-24T09:…
错误信息: [ERROR] Failed to execute goal org.codehaus.mojo:native2ascii-maven-plugin:1.0-alpha-1:native2ascii (native2ascii-utf8) on project tsbMngr: Execution native2ascii-utf8 of goal org.codehaus.mojo:native2ascii-maven-plugin:1.0-alpha-1:native2ascii…
1.使用git 升级 服务命令 mvn  deploy -e 之后报错: Failed to execute goal org.apache.maven.plugins:maven-surefire-plugin::test (: Failed to retrieve POM : Could not transfer artifact org.apache.maven.surefire:surefire-junit4:pom: from/to central (https://repo.mave…
报错信息 在Eclipse中执行mvn install时,console端显示如下报错信息: [ERROR] Failed to execute goal org.apache.maven.plugins:maven-compiler-plugin:2.3.2:compile (default-compile) on project ERP: Compilation failure: Compilation failure: [ERROR] \test01\src\main\java\HStyl…
使用maven创建project时碰到如下错误: D:\codes\JSF>mvn archetype:create -DgroupId=com.tutorialspoint.test -DartifactId=helloworld -DarchetypeArtifactId=maven-archetype-webapp [INFO] Scanning for projects... [INFO] [INFO] ------------------------------------------…
报错内容: Failed to execute goal org.apache.maven.plugins:maven-javadoc-plugin:2.10.2:jar (attach-javadocs) on project SLXFWZ: MavenReportException: Error while creating archive: Exit code: 1 - ����: δ֪��ö�ٳ��� FieldFill.INSERT ԭ��: �Ҳ���com.baomidou.myb…
报错信息: E:\MIKEY\mikey\HTML5\TestMaven_01>mvn package [INFO] Scanning for projects... [INFO] [INFO] ------------------------------------------------------------------------ [INFO] Building TestMaven_01 0.0.1-SNAPSHOT [INFO] ----------------------------…
maven打包成war时,报错: [ERROR] Failed to execute goal org.apache.maven.plugins:maven-war-plugin:2.2:war (default-war) on project child02: Error assembling WAR: webxml attribute is required (or pre-existing WEB-INF/web.xml if executing in update mode) -> [H…
报错 [ERROR] Failed to execute goal org.springframework.boot:spring-boot-maven-plugin:1.4.0.RELEASE:run (default-cli) on project demo: Could not exec java: Application finished with non-zero exit code: 1 -> [Help 1] [ERROR] [ERROR] To see the full stac…
maven进行install的时候,test类里面报错: COMPILATION ERROR : [INFO] ------------------------------------------------------------- [ERROR] /E:/147/cmu/src/test/java/com/migu/reading/stubCmu/NumberSegmentService.java:[22,8] com.migu.reading.stubCmu.NumberSegmentSe…
使用maven打包的时候出现如下错误: Failed to execute goal org.apache.maven.plugins:maven-compiler-plugin:3.1:compile (default-compile) 解决办法: 1.查看window--Preferences--Installed JREs 中是否引用的是本地的jdk,不是就改为本地jdk,一定要是JDK 2.若问题依旧存在,则还需要 查看window--Preferences--Installed JRE…